{"text_format":"3","workbook":"xlsx","n_sheets":6,"sheets":["Form 1","Form 2","data","MOU","drop-down","Topic"],"not_rendered":{"defined_names":53,"comments":2},"read":"whole","date_system":"1900"}

{"sheet":"Form 1","index":0,"n_rows":37,"n_cols":36,"rows_kept":37,"merged":[[0,0,0,33],[1,0,1,33],[2,0,2,33],[3,0,3,33],[4,0,4,8],[4,9,4,33],[5,0,6,8],[5,9,6,33],[7,0,7,8],[7,9,7,33],[8,0,8,33],[9,0,9,19],[9,20,9,28],[9,29,9,33],[10,0,10,6],[10,7,10,19],[10,20,10,28],[10,29,10,33],[11,0,11,6],[11,7,11,19],[11,20,11,28],[11,29,11,33],[11,35,11,40],[12,0,12,13],[12,14,12,33],[12,35,12,40],[13,0,13,13],[13,14,13,33],[13,35,14,40],[14,0,14,5],[14,6,14,33],[15,0,15,33],[15,35,15,40],[16,0,16,19],[16,20,17,33],[17,0,17,6],[17,7,17,19],[18,0,18,6],[18,7,18,19],[18,20,18,33],[19,0,19,33],[20,0,20,33],[21,0,21,5],[21,6,21,33],[22,0,22,33],[23,0,23,33],[24,0,24,4],[24,5,24,18],[24,19,24,33],[25,0,25,4],[25,5,25,18],[25,19,25,33],[26,0,26,4],[26,5,26,18],[26,19,26,33],[27,0,27,4],[27,5,27,18],[27,19,27,33],[28,0,28,4],[28,5,28,18],[28,19,28,33],[29,0,29,4],[29,5,29,18],[29,19,29,33],[30,0,30,33],[31,0,31,33],[32,0,32,33],[33,0,33,33],[34,0,34,33],[35,0,35,33],[36,0,36,33],[37,0,37,33],[38,0,38,33],[39,0,39,33],[40,0,40,33]]}
["rev0407"]
["Attachment1     “NII International Internship Program” Application Form 2025 2nd Call"]
[]
["Name of University/Institution:"]
["Country",{"$nulls":33},"1. Choose the name of the country where your home institution locates first."]
["Institute/University",{"$nulls":33},"2. Then choose the name of your home institution."]
[]
["Others",{"$nulls":33},"When you do not have the right name on the list, enter the name on \"others\"."]
["1. Candidate’s Information"]
["Name:",{"$nulls":19},"Date of birth:",{"$nulls":8},"Gender:"]
["FAMILY",{"$nulls":6},"GIVEN",{"$nulls":12},"yyyy/mm/dd",{"$nulls":8},"Male/Female"]
[{"$nulls":29},"drop-down",{"$nulls":5},"* NOTE *"]
["Master/Ph.D:",{"$nulls":13},"Nationality:",{"$nulls":20},"* Please fill in the boxes in GRAY."]
["choose from drop-down",{"$nulls":13},"choose from drop-down",{"$nulls":20},"* When a cell says \"(Choose from) drop-down\", please use a drop-down list."]
["E-mail:"]
["2. Supervisor’s Information at your university:",{"$nulls":34},"* Please fill in the form 2 as well."]
["Name:",{"$nulls":19},"Title/Position:"]
["FAMILY",{"$nulls":6},"GIVEN"]
[]
["Department:"]
{"$rows_left_out":18}
{"sheet":"Form 2","index":1,"n_rows":19,"n_cols":39,"rows_kept":19,"merged":[[0,0,0,32],[1,0,1,2],[1,3,1,4],[1,5,1,22],[1,23,1,32],[2,0,5,2],[2,3,5,4],[2,5,2,22],[2,23,3,32],[3,5,5,22],[4,23,5,32],[6,0,9,2],[6,3,9,4],[6,5,6,22],[6,23,7,32],[7,5,9,22],[8,23,9,32],[10,0,13,2],[10,3,13,4],[10,5,10,22],[10,23,11,32],[11,5,13,22],[12,23,13,32],[14,0,14,4],[14,5,14,32],[15,0,15,32],[16,0,17,3],[16,4,16,11],[16,12,17,15],[16,16,16,23],[16,24,17,26],[16,27,17,32],[17,4,17,11],[17,16,17,23],[18,0,18,32],[19,0,36,32]]}
["4. Research Topics (select up to 3 topics from “list of research topics” and fill out in order)",{"$nulls":37},"Please confirm the No. you enter."]
["Order",null,null,"No.",null,"Research Area／Title of the research",{"$nulls":17},"Supervisor "]
[1,{"$nulls":4},{"$f":"IF(Topic1=\"\",\"\",IF(ISERROR(VLOOKUP(Topic1, Topic!$A$3:$J$101, 2,0)&\"\"),$AM$1, VLOOKUP(Topic1, Topic!$A$3:$J$101, 2,0)))","v":""},{"$nulls":17},{"$f":"IF(Topic1=\"\",\"\",IF(ISERROR(VLOOKUP(Topic1,Topic!$A$3:$J$101,6,0)&\"\"),\"\",VLOOKUP(Topic1,Topic!$A$3:$J$101,6,0)))","v":""}]
[{"$nulls":5},{"$f":"IF(Topic1=\"\",\"\",IF(ISERROR(VLOOKUP(Topic1,Topic!$A$3:$J$101,3,0)&\"\"),$AM$1,VLOOKUP(Topic1,Topic!$A$3:$J$101,3,0)))","v":""}]
[{"$nulls":23},{"$f":"IF(Topic1=\"\",\"\",IF(ISERROR(VLOOKUP(Topic1,Topic!$A$3:$J$101,5,0)&\"\"),\"\",VLOOKUP(Topic1,Topic!$A$3:$J$101,5,0)))","v":""}]
[]
[2,{"$nulls":4},{"$f":"IF(Topic2=\"\",\"\",IF(ISERROR(VLOOKUP(Topic2,Topic!$A$3:$J$101,2,0)&\"\"),$AM$1,VLOOKUP(Topic2,Topic!$A$3:$J$101,2,0)))","v":""},{"$nulls":17},{"$f":"IF(Topic2=\"\",\"\",IF(ISERROR(VLOOKUP(Topic2,Topic!$A$3:$J$101,6,0)&\"\"),\"\",VLOOKUP(Topic2,Topic!$A$3:$J$101,6,0)))","v":""}]
[{"$nulls":5},{"$f":"IF(Topic2=\"\",\"\",IF(ISERROR(VLOOKUP(Topic2,Topic!$A$3:$J$101,3,0)&\"\"),$AM$1,VLOOKUP(Topic2,Topic!$A$3:$J$101,3,0)))","v":""}]
[{"$nulls":23},{"$f":"IF(Topic2=\"\",\"\",IF(ISERROR(VLOOKUP(Topic2,Topic!$A$3:$J$101,5,0)&\"\"),\"\",VLOOKUP(Topic2,Topic!$A$3:$J$101,5,0)))","v":""}]
[{"$nulls":36},"id","result","message"]
[3,{"$nulls":4},{"$f":"IF(Topic3=\"\",\"\",IF(ISERROR(VLOOKUP(Topic3,Topic!$A$3:$J$101,2,0)&\"\"),$AM$1,VLOOKUP(Topic3,Topic!$A$3:$J$101,2,0)))","v":""},{"$nulls":17},{"$f":"IF(Topic3=\"\",\"\",IF(ISERROR(VLOOKUP(Topic3,Topic!$A$3:$J$101,6,0)&\"\"),\"\",VLOOKUP(Topic3,Topic!$A$3:$J$101,6,0)))","v":""},{"$nulls":12},"Blank",{"$f":"IF(OR($E$17=\"\",$Q$17=\"\"),1,\"\")","v":1},"Error: Please do not leave [From] and/or [To] blank."]
[{"$nulls":5},{"$f":"IF(Topic3=\"\",\"\",IF(ISERROR(VLOOKUP(Topic3,Topic!$A$3:$J$101,3,0)&\"\"),$AM$1,VLOOKUP(Topic3,Topic!$A$3:$J$101,3,0)))","v":""},{"$nulls":30},"Error",{"$f":"IF(ISERROR(Duration),1,IF(AND($E$17<>\"\",$Q$17<>\"\",N(Duration)<0),1,\"\"))","v":""},"Error: Please correct the duration you entered."]
[{"$nulls":23},{"$f":"IF(Topic3=\"\",\"\",IF(ISERROR(VLOOKUP(Topic3,Topic!$A$3:$J$101,5,0)&\"\"),\"\",VLOOKUP(Topic3,Topic!$A$3:$J$101,5,0)))","v":""},{"$nulls":12},"Over",{"$f":"IF(ISERROR(Duration),\"\",IF(N($AB$17)>=166,1,\"\"))","v":""},"Error: The internship period should be less than 165 days."]
[{"$nulls":36},"Less",{"$f":"IF(ISERROR(Duration),\"\",IF(AND(N($AB$17)<60,N($AB$17)>=1),1,\"\"))","v":""},"Error: The internship period should be more than 60 days."]
["5. Duration:",{"$nulls":4},{"$f":"IF($AL$11=1,blank,IF($AL$12=1,error,IF($AL$13=1,over,IF($AL$14=1,less,\"\"))))","v":"Error: Please do not leave [From] and/or [To] blank."}]
["*NOTICE: Internship period at NII must be 60 to 165 days."]
["From:",{"$nulls":11},"To:",{"$nulls":11},"Days:",null,null,{"$f":"(IF(OR($E$17=\"\",$Q$17=\"\"),\"\",N($Q$17-$E$17+1)))","v":""}]
[{"$nulls":4},"yyyy/mm/dd",{"$nulls":11},"yyyy/mm/dd"]
["6. Objectives of your “NII International Internship Program”"]

{"sheet":"data","index":2,"n_rows":6,"n_cols":25,"rows_kept":6,"hidden":true,"merged":[[1,3,1,11],[1,12,1,16],[1,17,1,21],[1,22,1,24]]}
[]
[{"$nulls":3},"Applicant",{"$nulls":8},"Supervisor",{"$nulls":4},"Topic",{"$nulls":4},"Duration"]
[null,null,"Call","Family","First","MOU_Country","MOU_Name","Date of Birth","Gender","Master/PhD","Nationality","Email","Family","First","Title","Dept","Email","Order by Applicant","Topic\n№","Supervisor","research area"," Title of the research ","From","To","Days"]
[null,null,2,{"$f":"app_family","v":0},{"$f":"app_first","v":0},{"$f":"'Form 1'!J5","v":0},{"$f":"app_inst","v":0},{"$f":"app_birth","v":"00:00:00"},{"$f":"app_gender","v":"drop-down"},{"$f":"app_status","v":"choose from drop-down"},{"$f":"app_nationality","v":"choose from drop-down"},{"$f":"email","v":0},{"$f":"'Form 1'!A19","v":0},{"$f":"'Form 1'!H19","v":0},{"$f":"'Form 1'!U19","v":0},{"$f":"'Form 1'!A21","v":0},{"$f":"'Form 1'!G22","v":0},1,{"$f":"Topic1","v":0},{"$f":"VLOOKUP(S4,Table_1[],5,0)","v":{"$error":"#N/A"}},{"$f":"VLOOKUP(S4,Table_1[],2,0)","v":{"$error":"#N/A"}},{"$f":"VLOOKUP(S4,Table_1[],3,0)","v":{"$error":"#N/A"}},{"$f":"from","v":"00:00:00"},{"$f":"to","v":"00:00:00"},{"$f":"N(X4-W4+1)","v":1}]
[{"$nulls":17},2,{"$f":"Topic2","v":0},{"$f":"VLOOKUP(S5,Table_1[],5,0)","v":{"$error":"#N/A"}},{"$f":"VLOOKUP(S5,Table_1[],2,0)","v":{"$error":"#N/A"}},{"$f":"VLOOKUP(S5,Table_1[],3,0)","v":{"$error":"#N/A"}},{"$f":"from","v":"00:00:00"},{"$f":"to","v":"00:00:00"},{"$f":"N(X5-W5+1)","v":1}]
[{"$nulls":17},3,{"$f":"Topic3","v":0},{"$f":"VLOOKUP(S6,Table_1[],5,0)","v":{"$error":"#N/A"}},{"$f":"VLOOKUP(S6,Table_1[],2,0)","v":{"$error":"#N/A"}},{"$f":"VLOOKUP(S6,Table_1[],3,0)","v":{"$error":"#N/A"}},{"$f":"from","v":"00:00:00"},{"$f":"to","v":"00:00:00"},1]

{"sheet":"MOU","index":3,"n_rows":32,"n_cols":20,"rows_kept":32,"hidden":true}
["country","name of institutions"]
["Choose from drop-down"]
["America","THE UNIVERSITY OF MICHIGAN-DEARBORN, COLLEGE OF ENGINEERING AND COMPUTER SCIENCE","College of Enginnering, University of Washington, Seattle","New Jersey Institute of Technology","International Computer Science Institute (ICI-Berkeley)","University of Southern California, Viterbi School of Engineering","North American Coordinating Council on Japanese Library Resources (NCC)","New Venture Fund(\"NVF\") on behalf of the Scholarly Publishing & Academic Resources Coalition (\"SPARC\")","Indiana University, School of Informatics, Computing, and Engineering","University of Illinois at Urbana Champaign","Language Technology Institute (LTI), Carnegie Mellon University","Center for Open Science (COS)","・・・","・・・","・・・","・・・","・・・","・・・"]
["Argentina","The Faculty of Exact and Natural Sciences of Buenos Aires University","・・・","・・・","・・・","・・・","・・・","・・・","・・・","・・・","・・・","・・・","・・・","・・・","・・・","・・・","・・・","・・・"]
["Australia","The Faculty of Engineering and Information Technologies, The University of Sydney","School of Computing & Information Systems, Melbourne School of Engineering, The University of Melbourne","Royal Melbourne Institute of Technology","Monash University","・・・","・・・","・・・","・・・","・・・","・・・","・・・","・・・","・・・","・・・","・・・","・・・","・・・"]
["Austria","The Vienna University of Technology (TU Wien)","・・・","・・・","・・・","・・・","・・・","・・・","・・・","・・・","・・・","・・・","・・・","・・・","・・・","・・・","・・・","・・・"]
["Belgium","University of Namur","・・・","・・・","・・・","・・・","・・・","・・・","・・・","・・・","・・・","・・・","・・・","・・・","・・・","・・・","・・・","・・・"]
["Brazil","Pontifical Catholic University of Campinas","・・・","・・・","・・・","・・・","・・・","・・・","・・・","・・・","・・・","・・・","・・・","・・・","・・・","・・・","・・・","・・・"]
["Canada","School of Computer Science, McGill University","Polytechnique Montréal","Simon Fraser University","University of Alberta","Faculty of Mathematics, University of Waterloo","York University","・・・","・・・","・・・","・・・","・・・","・・・","・・・","・・・","・・・","・・・","・・・"]
["Chile","Pontificia Universidad Católica de Chile (PUCC)","・・・","・・・","・・・","・・・","・・・","・・・","・・・","・・・","・・・","・・・","・・・","・・・","・・・","・・・","・・・","・・・"]
["China","School of Information Science and Technology, Department of Automation, Tsinghua University","Tongji University","School of Computer Science, Peking University","The School of Electronic Information and Electrical Engineering of Shanghai Jiao Tong University","University of Science and Technology of China (USTC)","Institute of Computing Technology, Chinese Academy of Sciences","Institute of Scientific and Technical Information of China (ISTIC)","・・・","・・・","・・・","・・・","・・・","・・・","・・・","・・・","・・・","・・・"]
["Czech","The Czech Technical University in Prague","Charles University","・・・","・・・","・・・","・・・","・・・","・・・","・・・","・・・","・・・","・・・","・・・","・・・","・・・","・・・","・・・"]
["Egypt","The Egypt-Japan University of  Science and Technology(E-JUST)","・・・","・・・","・・・","・・・","・・・","・・・","・・・","・・・","・・・","・・・","・・・","・・・","・・・","・・・","・・・","・・・"]
["Finland","Aalto University, School of Electrical Engineering and School of Science","・・・","・・・","・・・","・・・","・・・","・・・","・・・","・・・","・・・","・・・","・・・","・・・","・・・","・・・","・・・","・・・"]
["France","Institut National de Recherche en Informatique et en Automatique (INRIA)","Grenoble INP","Université Grenoble Alpes (Université Joseph Fourier-Grenoble 1)","Laboratoire d'Informatique de Paris 6, Sorbonne Université (l'université Pierre et Marie Curie)","Institut National Polytechnique Toulouse (INP-ENSEEIHT)","The Central National de la Recherche Scientifique (CNRS)","Université Toulouse III - Paul Sabatier, Institut de Recherche en Informatique de Toulouse (IRIT)","Claude Bernard University Lyon 1","Université Paris Saclay, Graduate School of Computer Science (Université Paris Sud)","Université Côte d'Azur (University of Nice Sophia Antipolis)","Centre de Recherche en Informatique de Lens (CRIL)","Clermont Auvergne INP, School of Engineering ISIMA, LIMOS Laboratory (The Blaise Pascal University of Clermont-Ferrand)","the Nantes University, Laboratory of Digital Sciences of Nantes (LS2N)","Institut de Recherche en Informatique et Systemes Aleatoires (IRISA)","Ecole Normale Supérieure de Lyon (ENS Lyon)","EURECOM","Institut National des Sciences Appliquées de Lyon - INSA Lyon","・・・"]
["Germany","Faculty of Applied Computer Science, University of Augsburg","German Research Center for Artificial Intelligence (DFKI)","The University of Freiburg, the Faculty of Applied Sciences","The RWTH Aachen University, Faculty of Mathmatics, Computer Science and Natural Sciences","The German Academic Exchange Service (DAAD)","Saarland University","Technische Universität Berlin (TUB, TU Berlin)","Technische Universität Braunschweig (TU Braunschweig)","Department of Computer and Information Science, University of Konstanz","Technical University of Munich, the Department of Informatics and the Department of Electrical Engineering and Information Technology (TUM)","Georg-August-University of Göttingen, Institute of Computer Science, Centre for Computational Sciences, Campus Institute Data Science, Research Department of the State and University Library","HBZ","German National Library of Science and Technology (TIB)","German National Library of Medicine","The Faculty of Science at the University of Potsdam","Gesellschaft für wissenschaftliche Datenverarbeitung mbH Göttingen (GWDG)","University of Technology Nuremberg","Zuse Institute Berlin","・・・"]
["India","Indraprastha Institute of Information Technology, Delhi","・・・","・・・",null,"・・・","・・・","・・・","・・・","・・・","・・・","・・・","・・・","・・・","・・・","・・・","・・・","・・・"]
["Ireland","Dublin City University","Lero - the Irish Software Research Centre（The University of Limerick)","School of Computer Science and Statistics and ADAPT Centre, Trinity College Dublin","・・・","・・・","・・・","・・・","・・・","・・・","・・・","・・・","・・・","・・・","・・・","・・・","・・・","・・・"]
["Italy","Politecnico di Milano, Dipartimento di Elettronica, Informazione e Bioingegneria","Torino University, Department of Computer Science","UNIVERSITA' DEGLI STUDI DI FERRARA (UNIFE)","Dipartimento di Informatica - Scienza e Ingegneria (DISI), Universita di Bologna","University of Florence, Department of Information Engineering, Department of Statistics, Computer Sciences and Applications","・・・","・・・","・・・","・・・","・・・","・・・","・・・","・・・","・・・","・・・","・・・","・・・"]
["Korea","Department of Computer Science and Engineering, Seoul National University","Korea Education & Research Information Service (KERIS)","Korea Institute of Science and Technology Information (KISTI)","・・・","・・・","・・・","・・・","・・・","・・・","・・・","・・・","・・・","・・・","・・・","・・・","・・・","・・・"]
{"$rows_left_out":13}
{"sheet":"drop-down","index":4,"n_rows":242,"n_cols":4,"rows_kept":242,"hidden":true}
["gender","status","ID","nation"]
["drop-down","Choose from drop-down",null,"Choose from drop-down"]
["male","Master",null,"Afghanistan"]
["female","Ph.D",null,"Albania"]
[{"$nulls":3},"Algeria"]
[{"$nulls":3},"American Samoa"]
[{"$nulls":3},"Andorra"]
[{"$nulls":3},"Angola"]
[{"$nulls":3},"Anguilla"]
[{"$nulls":3},"Antigua and Barbuda"]
[{"$nulls":3},"Argentina"]
[{"$nulls":3},"Armenia"]
[{"$nulls":3},"Aruba"]
[{"$nulls":3},"Australia"]
[{"$nulls":3},"Austria"]
[{"$nulls":3},"Azerbaijan"]
[{"$nulls":3},"Bahamas"]
[{"$nulls":3},"Bahrain"]
[{"$nulls":3},"Bangladesh"]
[{"$nulls":3},"Barbados"]
{"$rows_left_out":223}
{"sheet":"Topic","index":5,"n_rows":95,"n_cols":10,"rows_kept":95,"hidden":true}
[]
["No.","Research area","Title of the research","Website","Name of supervisor","Title of the supervisor","Requirements for applicants: Master's / Ph.D. Student","Total number of acceptance per supervisor","Duration : 2-6months (less than 180days)","Comments"]
["P01101","Machine learning","Geometric analysis of machine learning models","https://mahito.nii.ac.jp","Mahito Sugiyama","Associate Professor","Ph.D.",2,"3 - 6 months","Legendre decomposition (information geometric tensor decomposition; NeurIPS2018): https://arxiv.org/abs/1802.04502\r\nMany-body approximation for tensors (NeurIPS2023): https://openreview.net/forum?id=5yedZXV7wt"]
["P01102","Machine learning","Geometric analysis of T-PRISM, a logic programming language based on tensor embedding for statistical modeling","https://mahito.nii.ac.jp","Mahito Sugiyama","Associate Professor","Ph.D.",2,"3 - 6 months","Legendre decomposition (information geometric tensor decomposition; NeurIPS2018): https://arxiv.org/abs/1802.04502\r\nT-PRISM: https://github.com/prismplp/prism"]
["P01103","Machine learning/Data mining","Machine learning for graphs","https://mahito.nii.ac.jp","Mahito Sugiyama","Associate Professor","Ph.D.",2,"3 - 6 months","Molecular Graph Generation by Decomposition and Reassembling: https://doi.org/10.1021/acsomega.3c01078"]
["P01201","Artificial Intelligence","Knowledge Graph Applications","http://www-kasm.nii.ac.jp/~takeda","Hideaki Takeda","Professor","Either",3,"3 - 6 months"]
["P01202","Artificial Intelligence","Building and Applications for Academic Knowledge Graph",null,"Hideaki Takeda","Professor","Either",3,"3 - 6 months"]
["P01203","Legal Informatics","Applying AI in the legal information processing","https://ds.rois.ac.jp/en_center7/","Hideaki Takeda","Professor","Either",3,"2 - 6 months"]
["P02001","Theoretical Computer Science","Sensitivity Analysis/Lipschitz Continuous Algorithms","https://arxiv.org/abs/2211.04674https://arxiv.org/abs/2111.02657https://arxiv.org/abs/2411.02744","Yuichi Yoshida","Professor","Ph.D.",3,"2 - 6 months"]
["P02002","Data Mining","Sensitivity Analysis/Lipschitz Continuous Algorithms","https://openreview.net/forum?id=VM7u8ecLrZVhttps://openreview.net/forum?id=boik01yhssB","Yuichi Yoshida","Professor","Ph.D.",3,"2 - 6 months"]
["P02003","Theoretical Computer Science","Spectral Graph Theory for Directed Graphs and Hypergraphs","https://arxiv.org/abs/2106.02353https://arxiv.org/abs/2201.07289","Yuichi Yoshida","Professor","Ph.D.",3,"2 - 6 months"]
["P02004","Theoretical Computer Science","Sublinear-time Algorithms","https://arxiv.org/abs/2204.08404https://arxiv.org/abs/2210.12601","Yuichi Yoshida","Professor","Ph.D.",3,"2 - 6 months"]
["P02101","Computational Complexity Theory","Meta-complexity, average-case complexity, pseudorandomness, and the Minimum Circuit Size Problem","https://eccc.weizmann.ac.il/report/2022/119/https://eccc.weizmann.ac.il/report/2021/058/","Shuichi Hirahara","Associate Professor","Either",2,"2 - 6 months","It is desirable that applicants have a conference publication in complexity theory."]
["P02701","Algorithmic game theory / Combinatorial optimization","Algorithmic studies on information design, correlated equilibria, and online learning","https://fujiik.github.io/","Kaito Fujii","Assistant Professor","Either",2,"2 - 6 months"]
["P03401","Robotics","Real-world robot learning",null,"Taisuke Kobayashi","Assistant Professor","Ph.D.",2,"4 - 6 months","Knowledge and experience of reinforcement learning and/or imitation learning are required. The details of the research contents will be decided by prior discussion."]
["P03501","Quantum information","Theoretical and/or numerical research on quantum information processing",null,"Akihito Soeda","Associate Professor","Either",1,"2 - 6 months"]
["P03601","Robotics olfaction, Mechatronics, System control engineering, Computational Neuroscience, Ethology","Modeling and Robot Implementation of Insect Locomotion Control Using Computational Neuroscience","https://sshigaki.jimdofree.com/research/","Shunsuke Shigaki","Assistant Professor","Ph.D.",1,"2 - 6 months"]
["P03701","Theoretical Computer Science","Parameterized Algorithms/Complexity","See e.g. https://arxiv.org/abs/2211.04278.","Philip Wellnitz","Assistant Professor","Ph.D.",2,"4 - 6 months"]
["P03702","Theoretical Computer Science","Fine-Grained Complexity Theory/Algorithm Design","See e.g. https://arxiv.org/abs/2305.06659 or https://arxiv.org/abs/2010.09096","Philip Wellnitz","Assistant Professor","Either",2,"4 - 6 months"]
["P03703","Theoretical Computer Science/Algorithm Engineering","Fast Approximate String Matching in Practice","Preference is given to longer stays.","Philip Wellnitz","Assistant Professor","Either",2,"4 - 6 months","The ultimate goal would be to implement (parts of) https://arxiv.org/abs/2004.08350, especially in the fully-compressed setting for Hamming distance. Efficient implementations might require theoretical results as well. Profound knowledge in C++ or Rust is preferred."]
{"$rows_left_out":75}